Target
Intestinal-type alkaline phosphatase
Ligand
BDBM50252093
Substrate
Meas. Tech.
Dose Response confirmation of uHTS activators of Mouse Intestinal Alkaline Phosphatase using Human Intestinal Alkaline Phosphatase
EC50
8330±n/a nM
Citation
 PubChem, PC Dose Response confirmation of uHTS activators of Mouse Intestinal Alkaline Phosphatase using Human Intestinal Alkaline Phosphatase PubChem Bioassay (2010)[AID] 
Target
Name:
Intestinal-type alkaline phosphatase
Synonyms:
ALPI Intestinal alkaline phosphatase | PPBI_HUMAN
Type:
PROTEIN
Mol. Mass.:
56804.94
Organism:
Homo sapiens (Human)
Description:
ChEMBL_1278525
Residue:
528
  
Inhibitor
Name:
BDBM50252093
Synonyms:
6-hydroxybenzo[d][1,3]oxathiol-2-one cid_72139
Type:
Small organic molecule
Emp. Form.:
C7H4O3S
Mol. Mass.:
168.17
SMILES:
Oc1ccc2sc(=O)oc2c1
: