Target
Intestinal-type alkaline phosphatase 1
Ligand
BDBM75661
Substrate
Meas. Tech.
Dose Response confirmation of uHTS inhibitors of Human Intestinal Alkaline Phosphatase using Mouse Intestinal Alkaline Phosphatase
IC50
49800±n/a nM
Citation
 PubChem, PC Dose Response confirmation of uHTS inhibitors of Human Intestinal Alkaline Phosphatase using Mouse Intestinal Alkaline Phosphatase PubChem Bioassay (2010)[AID] 
Target
Name:
Intestinal-type alkaline phosphatase 1
Synonyms:
Alpi | PPBI1_RAT
Type:
Enzyme Catalytic Domain
Mol. Mass.:
58396.39
Organism:
Rattus norvegicus (Rat)
Description:
P15693
Residue:
540
  
Inhibitor
Name:
BDBM75661
Synonyms:
4-[(2-methyl-[1,2,4]triazolo[1,5-c]quinazolin-5-yl)hydrazo]-4-oxo-N-[2-(4-phenyl-1-piperazinyl)ethyl]butanamide 4-[2-(2-methyl-[1,2,4]triazolo[1,5-c]quinazolin-5-yl)hydrazinyl]-4-oxo-N-[2-(4-phenylpiperazin-1-yl)ethyl]butanamide MLS000924746 cid_24789597
Type:
Small organic molecule
Emp. Form.:
C26H31N9O2
Mol. Mass.:
501.5834
SMILES:
Cc1nc2c3ccccc3nc(NNC(=O)CCC(=O)NCCN3CCN(CC3)c3ccccc3)n2n1
: