Target
Alkaline phosphatase, tissue-nonspecific isozyme
Ligand
BDBM39713
Substrate
Meas. Tech.
Dose Response confirmation of uHTS activators of Human Intestinal Alkaline Phosphatase using Tissue Nonspecific Alkaline Phosphatase.
EC50
636±n/a nM
Citation
 PubChem, PC Dose Response confirmation of uHTS activators of Human Intestinal Alkaline Phosphatase using Tissue Nonspecific Alkaline Phosphatase. PubChem Bioassay (2010)[AID] 
Target
Name:
Alkaline phosphatase, tissue-nonspecific isozyme
Synonyms:
ALPL tissue-nonspecific alkaline phosphatase precursor
Type:
PROTEIN
Mol. Mass.:
57306.17
Organism:
Homo sapiens (Human)
Description:
ChEMBL_1448917
Residue:
524
  
Inhibitor
Name:
BDBM39713
Synonyms:
1'-allylspiro[1,2-dihydro-4,1,2-benzoxadiazine-3,3'-indoline]-2'-one 1'-prop-2-enylspiro[1,2-dihydro-4,1,2-benzoxadiazine-3,3'-indole]-2'-one SMR000153589 | cid_4879299
Type:
Small organic molecule
Emp. Form.:
C17H15N3O2
Mol. Mass.:
293.3199
SMILES:
C=CCN1C(=O)C2(NNc3ccccc3O2)c2ccccc12
: