Target
Alkaline phosphatase, tissue-nonspecific isozyme
Ligand
BDBM65289
Substrate
Meas. Tech.
Dose Response confirmation of uHTS activators of Human Intestinal Alkaline Phosphatase using Tissue Nonspecific Alkaline Phosphatase.
EC50
11800±n/a nM
Citation
 PubChem, PC Dose Response confirmation of uHTS activators of Human Intestinal Alkaline Phosphatase using Tissue Nonspecific Alkaline Phosphatase. PubChem Bioassay (2010)[AID] 
Target
Name:
Alkaline phosphatase, tissue-nonspecific isozyme
Synonyms:
ALPL tissue-nonspecific alkaline phosphatase precursor
Type:
PROTEIN
Mol. Mass.:
57306.17
Organism:
Homo sapiens (Human)
Description:
ChEMBL_1448917
Residue:
524
  
Inhibitor
Name:
BDBM65289
Synonyms:
(E)-N-[(salicyloylamino)thiocarbamoyl]-3-(2-thienyl)acrylamide (E)-N-[[(2-hydroxyphenyl)carbonylamino]carbamothioyl]-3-thiophen-2-yl-prop-2-enamide MLS000703259 cid_5763840
Type:
Small organic molecule
Emp. Form.:
C15H13N3O3S2
Mol. Mass.:
347.412
SMILES:
Oc1ccccc1C(=O)NNC(=S)NC(=O)\C=C\c1cccs1
: