Target
Alkaline phosphatase, germ cell type
Ligand
BDBM75622
Substrate
Meas. Tech.
Dose Response confirmation of uHTS activators of Human Intestinal Alkaline Phosphatase using Placental Alkaline Phosphatase
EC50
20400±n/a nM
Citation
 PubChem, PC Dose Response confirmation of uHTS activators of Human Intestinal Alkaline Phosphatase using Placental Alkaline Phosphatase PubChem Bioassay (2010)[AID] 
Target
Name:
Alkaline phosphatase, germ cell type
Synonyms:
ALPG ALPPL2 PPBN_HUMAN | placental-like alkaline phosphatase preproprotein
Type:
PROTEIN
Mol. Mass.:
57374.31
Organism:
Homo sapiens (Human)
Description:
ChEMBL_29964
Residue:
532
  
Inhibitor
Name:
BDBM75622
Synonyms:
1-cyclohexyl-3-[2-(3,4-diethoxyphenyl)ethanoylamino]thiourea 1-cyclohexyl-3-[[2-(3,4-diethoxyphenyl)acetyl]amino]thiourea N-cyclohexyl-2-[(3,4-diethoxyphenyl)acetyl]hydrazinecarbothioamide cid_2954230
Type:
Small organic molecule
Emp. Form.:
C19H29N3O3S
Mol. Mass.:
379.517
SMILES:
CCOc1ccc(CC(=O)NNC(=S)NC2CCCCC2)cc1OCC
: