Target
Alkaline phosphatase, germ cell type
Ligand
BDBM75684
Substrate
Meas. Tech.
Dose Response confirmation of uHTS activators of Human Intestinal Alkaline Phosphatase using Placental Alkaline Phosphatase
EC50
14300±n/a nM
Citation
 PubChem, PC Dose Response confirmation of uHTS activators of Human Intestinal Alkaline Phosphatase using Placental Alkaline Phosphatase PubChem Bioassay (2010)[AID] 
Target
Name:
Alkaline phosphatase, germ cell type
Synonyms:
ALPG ALPPL2 PPBN_HUMAN | placental-like alkaline phosphatase preproprotein
Type:
PROTEIN
Mol. Mass.:
57374.31
Organism:
Homo sapiens (Human)
Description:
ChEMBL_29964
Residue:
532
  
Inhibitor
Name:
BDBM75684
Synonyms:
1-cyclohexyl-3-[(3-methylthiophen-2-yl)carbonylamino]thiourea 1-cyclohexyl-3-[[(3-methyl-2-thiophenyl)-oxomethyl]amino]thiourea N-cyclohexyl-2-[(3-methyl-2-thienyl)carbonyl]hydrazinecarbothioamide cid_1231792
Type:
Small organic molecule
Emp. Form.:
C13H19N3OS2
Mol. Mass.:
297.439
SMILES:
Cc1ccsc1C(=O)NNC(=S)NC1CCCCC1
: