Target
Alkaline phosphatase, germ cell type
Ligand
BDBM75702
Substrate
Meas. Tech.
Dose Response confirmation of uHTS activators of Human Intestinal Alkaline Phosphatase using Placental Alkaline Phosphatase
EC50
19800±n/a nM
Citation
 PubChem, PC Dose Response confirmation of uHTS activators of Human Intestinal Alkaline Phosphatase using Placental Alkaline Phosphatase PubChem Bioassay (2010)[AID] 
Target
Name:
Alkaline phosphatase, germ cell type
Synonyms:
ALPG ALPPL2 PPBN_HUMAN | placental-like alkaline phosphatase preproprotein
Type:
PROTEIN
Mol. Mass.:
57374.31
Organism:
Homo sapiens (Human)
Description:
ChEMBL_29964
Residue:
532
  
Inhibitor
Name:
BDBM75702
Synonyms:
4-N-(1,2-oxazol-3-yl)-5-N-[(1R)-1-phenylethyl]-1H-imidazole-4,5-dicarboxamide N-isoxazol-3-yl-N'-[(1R)-1-phenylethyl]-1H-imidazole-4,5-dicarboxamide N4-(3-isoxazolyl)-N5-[(1R)-1-phenylethyl]-1H-imidazole-4,5-dicarboxamide cid_42628367
Type:
Small organic molecule
Emp. Form.:
C16H15N5O3
Mol. Mass.:
325.322
SMILES:
C[C@@H](NC(=O)c1[nH]cnc1C(=O)Nc1ccon1)c1ccccc1
: