Target
Caspase-3
Ligand
BDBM29652
Substrate
Meas. Tech.
Dose Response confirmation of inhibitors of Sentrin-specific proteases (SENPs) using a Caspase-3 Selectivity assay
IC50
31200±n/a nM
Citation
 PubChem, PC Dose Response confirmation of inhibitors of Sentrin-specific proteases (SENPs) using a Caspase-3 Selectivity assay PubChem Bioassay (2010)[AID] 
Target
Name:
Caspase-3
Synonyms:
Apopain CASP3 CPP-32 Caspase 3 Caspase-3 subunit p17 SCA-1 Yama protein | caspase-3 preproprotein
Type:
Hydrolase; heterotetramer of two heterodimers
Mol. Mass.:
31607.55
Organism:
Homo sapiens (Human)
Description:
Residue:
277
  
Inhibitor
Name:
BDBM29652
Synonyms:
5-chloranyl-N-[4-([1,3]thiazolo[5,4-b]pyridin-2-yl)phenyl]thiophene-2-sulfonamide 5-chloro-N-[4-(2-thiazolo[5,4-b]pyridinyl)phenyl]-2-thiophenesulfonamide MLS000529654 cid_9550485
Type:
Small organic molecule
Emp. Form.:
C16H10ClN3O2S3
Mol. Mass.:
407.918
SMILES:
Clc1ccc(s1)S(=O)(=O)Nc1ccc(cc1)-c1nc2cccnc2s1
: