Target
Epidermal growth factor receptor [T790M,L858R]
Ligand
BDBM50391089
Substrate
Meas. Tech.
TBD
IC50
>1000±n/a nM
Citation
 Hu, SLiu, XBai, JLong, W Protein tyrosine kinase modulators and methods of use US Patent  US10059688 Publication Date 8/28/2018 
Target
Name:
Epidermal growth factor receptor [T790M,L858R]
Synonyms:
EGFR EGFR_HUMAN ERBB1 Epidermal growth factor receptor (EGFR)(T790M/L858R) Epidermal growth factor receptor (T790M, L858R) Epidermal growth factor receptor(L858R, T790M) | HER1
Type:
Mol. Mass.:
134353.72
Organism:
Homo sapiens (Human)
Description:
P00533[T790M,L858R]
Residue:
1210
  
Inhibitor
Name:
BDBM50391089
Synonyms:
BPI-2009 Conmana Lcotinib | US9783524, Icotinib
Type:
Small organic molecule
Emp. Form.:
C22H21N3O4
Mol. Mass.:
391.4198
SMILES:
C#Cc1cccc(Nc2ncnc3cc4OCCOCCOCCOc4cc23)c1
: