Target
Voltage-dependent T-type calcium channel subunit alpha-1H
Ligand
BDBM76828
Substrate
Meas. Tech.
Inhibitors of T-Type Calcium Channel
EC50
986±0 nM
Citation
 PubChem, PC Inhibitors of T-Type Calcium Channel PubChem Bioassay (2010)[AID] 
Target
Name:
Voltage-dependent T-type calcium channel subunit alpha-1H
Synonyms:
CAC1H_HUMAN Low-voltage-activated calcium channel alpha1 3.2 subunit Voltage-gated calcium channel voltage-dependent T-type calcium channel subunit alpha-1H isoform a
Type:
Enzyme Catalytic Domain
Mol. Mass.:
259187.68
Organism:
Homo sapiens (Human)
Description:
Calcium channel (Type T,L) 0 0::O95180
Residue:
2353
  
Inhibitor
Name:
BDBM76828
Synonyms:
1-[(2,3-Dimethoxy-phenyl)-(1-phenethyl-1H-tetrazol-5-yl)-methyl]-4-phenyl-piperazine 1-[(2,3-dimethoxyphenyl)-[1-(2-phenylethyl)-1,2,3,4-tetrazol-5-yl]methyl]-4-phenyl-piperazine 1-[(2,3-dimethoxyphenyl)-[1-(2-phenylethyl)tetrazol-5-yl]methyl]-4-phenylpiperazine SMR000005102 | cid_650046
Type:
Small organic molecule
Emp. Form.:
C28H32N6O2
Mol. Mass.:
484.5927
SMILES:
COc1cccc(C(N2CCN(CC2)c2ccccc2)c2nnnn2CCc2ccccc2)c1OC
: