Target
Caspase-7
Ligand
BDBM77496
Substrate
Meas. Tech.
Counterscreen for procaspase-3 activators: absorbance-based biochemical high throughput dose response assay for activators of procaspase-7
EC50
>85275±n/a nM
Citation
 PubChem, PC Counterscreen for procaspase-3 activators: absorbance-based biochemical high throughput dose response assay for activators of procaspase-7 PubChem Bioassay (2010)[AID] 
Target
Name:
Caspase-7
Synonyms:
Apoptotic protease Mch-3 CASP7 CMH-1 MCH3 | caspase 7, apoptosis-related cysteine peptidase
Type:
Enzyme
Mol. Mass.:
34273.91
Organism:
Homo sapiens (Human)
Description:
P55210
Residue:
303
  
Inhibitor
Name:
BDBM77496
Synonyms:
2,2-Dimethyl-5-(5-methyl-furan-2-yl)-2,3,5,6-tetrahydro-1H-benzo[a]phenanthridin-4-one 2,2-dimethyl-5-(5-methyl-2-furyl)-1,3,5,6-tetrahydrobenzo[a]phenanthridin-4-one MLS000525463 cid_3107511
Type:
Small organic molecule
Emp. Form.:
C24H23NO2
Mol. Mass.:
357.4449
SMILES:
Cc1ccc(o1)C1Nc2ccc3ccccc3c2C2=C1C(=O)CC(C)(C)C2
: