Target
Ubiquitin-conjugating enzyme E2 N
Ligand
BDBM68115
Substrate
Meas. Tech.
Dose Response confirmation of uHTS for the identification of UBC13 Polyubiquitin Inhibitors via a TR-FRET Assay
IC50
>20000±0 nM
Citation
 PubChem, PC Dose Response confirmation of uHTS for the identification of UBC13 Polyubiquitin Inhibitors via a TR-FRET Assay PubChem Bioassay (2011)[AID] 
Target
Name:
Ubiquitin-conjugating enzyme E2 N
Synonyms:
BLU UBE2N_HUMAN | ubiquitin-conjugating enzyme E2 N
Type:
PROTEIN
Mol. Mass.:
17137.61
Organism:
Homo sapiens (Human)
Description:
EBI_101440
Residue:
152
  
Inhibitor
Name:
BDBM68115
Synonyms:
(5-methyl-2-propan-2-yl-cyclohexyl) 2-[3-methyl-2-[(3-methylphenoxy)methyl]benzimidazol-3-ium-1-yl]ethanoate;chloride 2-[3-methyl-2-[(3-methylphenoxy)methyl]-1-benzimidazol-3-iumyl]acetic acid (5-methyl-2-propan-2-ylcyclohexyl) ester;chloride MLS000711089 cid_16192618
Type:
Small organic molecule
Emp. Form.:
C28H37N2O3
Mol. Mass.:
449.6044
SMILES:
CC(C)C1CCC(C)CC1OC(=O)Cn1c(COc2cccc(C)c2)[n+](C)c2ccccc12
: