Target
Ubiquitin-conjugating enzyme E2 N
Ligand
BDBM51858
Substrate
Meas. Tech.
Dose Response confirmation of uHTS for the identification of UBC13 Polyubiquitin Inhibitors via a TR-FRET Assay reconfirm
IC50
6273±444 nM
Citation
 PubChem, PC Dose Response confirmation of uHTS for the identification of UBC13 Polyubiquitin Inhibitors via a TR-FRET Assay reconfirm PubChem Bioassay (2011)[AID] 
Target
Name:
Ubiquitin-conjugating enzyme E2 N
Synonyms:
BLU UBE2N_HUMAN | ubiquitin-conjugating enzyme E2 N
Type:
PROTEIN
Mol. Mass.:
17137.61
Organism:
Homo sapiens (Human)
Description:
EBI_101440
Residue:
152
  
Inhibitor
Name:
BDBM51858
Synonyms:
MLS000562887 YW-IW | cid_16196440
Type:
Small organic molecule
Emp. Form.:
C59H75ClN18O6
Mol. Mass.:
1167.797
SMILES:
Cl.CCC(C)[C@H](N)c1cn(nn1)[C@@H](Cc1cc2ccccc2[nH]1)C(=O)N1CCN(CC1)c1nc(NCCOCCOCCOCC#C)nc(n1)N1CCN(CC1)C(=O)[C@H](Cc1cc2ccccc2[nH]1)n1cc(nn1)[C@@H](N)Cc1ccc(O)cc1
: