Target
X-box-binding protein 1
Ligand
BDBM61569
Substrate
Meas. Tech.
XBP1 DR counterscreen for CHOP
IC50
5350±n/a nM
Citation
 PubChem, PC XBP1 DR counterscreen for CHOP PubChem Bioassay (2011)[AID] 
Target
Name:
X-box-binding protein 1
Synonyms:
TREB5 XBP1_HUMAN | XBP2
Type:
Enzyme Catalytic Domain
Mol. Mass.:
28704.14
Organism:
Homo sapiens (Human)
Description:
gi_47678753
Residue:
261
  
Inhibitor
Name:
BDBM61569
Synonyms:
(2S)-2-[[4-[[4-[(tert-butoxycarbonylamino)methyl]phenyl]carbamoyl]-1H-imidazole-5-carbonyl]amino]propionic acid tert-butyl ester ILP-IV-66 SMR000465904 tert-butyl (2S)-2-[[4-[[4-[[(2-methylpropan-2-yl)oxycarbonylamino]methyl]phenyl]carbamoyl]-1H-imidazol-5-yl]carbonylamino]propanoate | tert-butyl (2S)-2-[[4-[[4-[[(2-methylpropan-2-yl)oxycarbonylamino]methyl]phenyl]carbamoyl]-1H-imidazole-5-carbonyl]amino]propanoate
Type:
Small organic molecule
Emp. Form.:
C24H33N5O6
Mol. Mass.:
487.5487
SMILES:
C[C@H](NC(=O)c1nc[nH]c1C(=O)Nc1ccc(CNC(=O)OC(C)(C)C)cc1)C(=O)OC(C)(C)C
: