Target
DNA damage-inducible transcript 3 protein
Ligand
BDBM55768
Substrate
Meas. Tech.
CHOP dose-response primary assay
IC50
>10000±n/a nM
Citation
 PubChem, PC CHOP dose-response primary assay PubChem Bioassay (2011)[AID] 
Target
Name:
DNA damage-inducible transcript 3 protein
Synonyms:
Chop DDIT3_MOUSE Gadd153
Type:
Enzyme Catalytic Domain
Mol. Mass.:
19175.17
Organism:
Mus musculus
Description:
gi_160707929
Residue:
168
  
Inhibitor
Name:
BDBM55768
Synonyms:
(5-methyl-2-propan-2-yl-cyclohexyl) 2-[3-methyl-2-[(2-methylphenoxy)methyl]benzimidazol-3-ium-1-yl]ethanoate;chloride 2-[3-methyl-2-[(2-methylphenoxy)methyl]-1-benzimidazol-3-iumyl]acetic acid (5-methyl-2-propan-2-ylcyclohexyl) ester;chloride MLS000709405 cid_16192954
Type:
Small organic molecule
Emp. Form.:
C28H37N2O3
Mol. Mass.:
449.6044
SMILES:
CC(C)C1CCC(C)CC1OC(=O)Cn1c(COc2ccccc2C)[n+](C)c2ccccc12
: