Target
Beta-adrenergic receptor kinase 1
Ligand
BDBM79496
Substrate
Meas. Tech.
Dose Response of inhibitors of GRK2 binding with RNA aptamer, Cherry Pick 1
EC50
4530±n/a nM
Citation
 PubChem, PC Dose Response of inhibitors of GRK2 binding with RNA aptamer, Cherry Pick 1 PubChem Bioassay (2011)[AID] 
Target
Name:
Beta-adrenergic receptor kinase 1
Synonyms:
ADRBK1 BARK Beta-ARK-1 G-protein coupled receptor kinase 2 GRK2
Type:
Enzyme
Mol. Mass.:
79581.30
Organism:
Homo sapiens (Human)
Description:
P25098
Residue:
689
  
Inhibitor
Name:
BDBM79496
Synonyms:
2-[3-[butyl(dimethyl)ammonio]propanoylamino]-2-methyl-propane-1-sulfonate 2-[3-[butyl(dimethyl)azaniumyl]propanoylamino]-2-methylpropane-1-sulfonate MLS000554254 cid_1870615
Type:
Small organic molecule
Emp. Form.:
C13H28N2O4S
Mol. Mass.:
308.437
SMILES:
CCCC[N+](C)(C)CCC(=O)NC(C)(C)CS([O-])(=O)=O
: