Target
Mitochondrial import inner membrane translocase subunit TIM23
Ligand
BDBM67953
Substrate
Meas. Tech.
Dose Response confirmation of uHTS small molecule inhibitors of tim10-1: a luminescent tim23-1 yeast counterscreen.
IC50
2920±n/a nM
Citation
 PubChem, PC Dose Response confirmation of uHTS small molecule inhibitors of tim10-1: a luminescent tim23-1 yeast counterscreen. PubChem Bioassay (2011)[AID] 
Target
Name:
Mitochondrial import inner membrane translocase subunit TIM23
Synonyms:
MAS6 MPI3 TIM23_YEAST | TPA: Essential component of the Translocase of the Inner Mitochondrial membrane (TIM23 complex)
Type:
Enzyme Catalytic Domain
Mol. Mass.:
23245.32
Organism:
Saccharomyces cerevisiae S288c
Description:
gi_285814664
Residue:
222
  
Inhibitor
Name:
BDBM67953
Synonyms:
1-(3-chlorophenyl)-3-(1-phenyltetrazol-5-yl)sulfanylpyrrolidine-2,5-dione 1-(3-chlorophenyl)-3-[(1-phenyl-1H-tetrazol-5-yl)thio]-2,5-pyrrolidinedione 1-(3-chlorophenyl)-3-[(1-phenyltetrazol-5-yl)thio]pyrrolidine-2,5-quinone SMR000199391 | cid_2950397
Type:
Small organic molecule
Emp. Form.:
C17H12ClN5O2S
Mol. Mass.:
385.827
SMILES:
Oc1cc(Sc2nnnn2-c2ccccc2)c(O)n1-c1cccc(Cl)c1
: