Target
Neurotensin receptor type 1
Ligand
BDBM51798
Substrate
Meas. Tech.
Dose Response confirmation of Image-Based HTS for Selective Agonists for NTR1
EC50
5720±n/a nM
Citation
 PubChem, PC Dose Response confirmation of Image-Based HTS for Selective Agonists for NTR1 PubChem Bioassay (2011)[AID] 
Target
Name:
Neurotensin receptor type 1
Synonyms:
Dopamine receptor D2L/neurotensin receptor NTS1 NTRR Neurotensin receptor 1 | neurotensin receptor type 1
Type:
PROTEIN
Mol. Mass.:
46278.89
Organism:
Homo sapiens (Human)
Description:
ChEMBL_1453811
Residue:
418
  
Inhibitor
Name:
BDBM51798
Synonyms:
3-(4-fluorophenyl)-7,8-dimethoxy-5-[(4-methoxyphenyl)methyl]pyrazolo[4,3-c]quinoline MLS000530112 cid_2136935
Type:
Small organic molecule
Emp. Form.:
C26H22FN3O3
Mol. Mass.:
443.4696
SMILES:
COc1ccc(Cn2cc3c(nnc3c3cc(OC)c(OC)cc23)-c2ccc(F)cc2)cc1
: