Target
Neurotensin receptor type 1
Ligand
BDBM16673
Substrate
Meas. Tech.
Dose Response confirmation of Image-Based HTS for Selective Agonists for NTR1
EC50
14600±n/a nM
Citation
 PubChem, PC Dose Response confirmation of Image-Based HTS for Selective Agonists for NTR1 PubChem Bioassay (2011)[AID] 
Target
Name:
Neurotensin receptor type 1
Synonyms:
Dopamine receptor D2L/neurotensin receptor NTS1 NTRR Neurotensin receptor 1 | neurotensin receptor type 1
Type:
PROTEIN
Mol. Mass.:
46278.89
Organism:
Homo sapiens (Human)
Description:
ChEMBL_1453811
Residue:
418
  
Inhibitor
Name:
BDBM16673
Synonyms:
4-[4-({[4-chloro-3-(trifluoromethyl)phenyl]carbamoyl}amino)phenoxy]-N-methylpyridine-2-carboxamide BAY 43-9006 BAY439006 Hit compound, 8 Sorafenib US10183928, Sorafenib US10227329, Compound Sorafenib US10774070, Compound Sorafenib US11279688, Compound Sorafenib US9029401, Sorafenib US9902709, Comparative example 1 cid_216239
Type:
Small organic molecule
Emp. Form.:
C21H16ClF3N4O3
Mol. Mass.:
464.825
SMILES:
CNC(=O)c1cc(Oc2ccc(NC(=O)Nc3ccc(Cl)c(c3)C(F)(F)F)cc2)ccn1
: