Target
Integrin alpha-L
Ligand
BDBM79615
Substrate
Meas. Tech.
Dose Response of Developing T Cell Immune Modulators with powder sourced compounds
EC50
29107±n/a nM
Citation
 PubChem, PC Dose Response of Developing T Cell Immune Modulators with powder sourced compounds PubChem Bioassay (2011)[AID] 
Target
Name:
Integrin alpha-L
Synonyms:
CD11 antigen-like family member A Itgal Leukocyte function-associated molecule 1 alpha chain Ly-15 | Lymphocyte antigen 15
Type:
Enzyme Catalytic Domain
Mol. Mass.:
128317.79
Organism:
Mus musculus
Description:
P24063
Residue:
1163
  
Inhibitor
Name:
BDBM79615
Synonyms:
1-(2-methylbenzoyl)-N-(4-methyl-3-piperidin-1-ylsulfonylphenyl)piperidine-4-carboxamide 1-[(2-methylphenyl)-oxomethyl]-N-[4-methyl-3-(1-piperidinylsulfonyl)phenyl]-4-piperidinecarboxamide VU0424160-1 | cid_16277168
Type:
Small organic molecule
Emp. Form.:
C26H33N3O4S
Mol. Mass.:
483.623
SMILES:
Cc1ccccc1C(=O)N1CCC(CC1)C(=O)Nc1ccc(C)c(c1)S(=O)(=O)N1CCCCC1
: