Target
DNA dC->dU-editing enzyme APOBEC-3G
Ligand
BDBM38589
Substrate
Meas. Tech.
Dose Response confirmation of small molecule APOBEC3G DNA Deaminase Inhibitors via a fluorescence-based single-stranded DNA deaminase assay
Temperature
298.15±n/a K
IC50
1350±n/a nM
Comments
extracted
Citation
 PubChem, PC Dose Response confirmation of small molecule APOBEC3G DNA Deaminase Inhibitors via a fluorescence-based single-stranded DNA deaminase assay PubChem Bioassay (2011)[AID] 
Target
Name:
DNA dC->dU-editing enzyme APOBEC-3G
Synonyms:
ABC3G_HUMAN | APOBEC3G
Type:
Enzyme Catalytic Domain
Mol. Mass.:
46419.54
Organism:
Homo sapiens (Human)
Description:
gi_13399304
Residue:
384
  
Inhibitor
Name:
BDBM38589
Synonyms:
5-(4-methylphenyl)-2H-[1,3]thiazolo[2,3-c][1,2,4]triazole-3-thione 5-(p-tolyl)-2H-thiazolo[2,3-c][1,2,4]triazole-3-thione SMR000066274 | cid_2383729
Type:
Small organic molecule
Emp. Form.:
C11H9N3S2
Mol. Mass.:
247.339
SMILES:
Cc1ccc(cc1)-c1csc2n[nH]c(=S)n12
: