Target
DNA dC->dU-editing enzyme APOBEC-3G
Ligand
BDBM44137
Substrate
Meas. Tech.
Dose Response confirmation of small molecule APOBEC3G DNA Deaminase Inhibitors via a fluorescence-based single-stranded DNA deaminase assay
Temperature
298.15±n/a K
IC50
892±n/a nM
Comments
extracted
Citation
 PubChem, PC Dose Response confirmation of small molecule APOBEC3G DNA Deaminase Inhibitors via a fluorescence-based single-stranded DNA deaminase assay PubChem Bioassay (2011)[AID] 
Target
Name:
DNA dC->dU-editing enzyme APOBEC-3G
Synonyms:
ABC3G_HUMAN | APOBEC3G
Type:
Enzyme Catalytic Domain
Mol. Mass.:
46419.54
Organism:
Homo sapiens (Human)
Description:
gi_13399304
Residue:
384
  
Inhibitor
Name:
BDBM44137
Synonyms:
5-anilino-3H-1,3,4-thiadiazole-2-thione CHEMBL289356 SMR000281390 | cid_707055
Type:
Small organic molecule
Emp. Form.:
C8H7N3S2
Mol. Mass.:
209.291
SMILES:
Sc1nnc(Nc2ccccc2)s1
: