Target
Egl nine homolog 1
Ligand
BDBM109467
Substrate
Meas. Tech.
HIF-PH Assay
pH
7.4±n/a
IC50
87900±n/a nM
Comments
extracted
Citation
 Ng, DArend, MPFlippin, LA Naphthyridine derivatives as inhibitors of Hypoxia inducible factor (HIF) hydroxylase US Patent  US9695170 Publication Date 7/4/2017 
Target
Name:
Egl nine homolog 1
Synonyms:
C1orf12 EGLN1_HUMAN Hypoxia-inducible factor prolyl hydroxylase 2 (HIF-PH2) Prolyl hydroxylase domain-containing protein 2 (PHD2)
Type:
Protein
Mol. Mass.:
46035.59
Organism:
Homo sapiens (Human)
Description:
Q9GZT9
Residue:
426
  
Inhibitor
Name:
BDBM109467
Synonyms:
US9695170 142
Type:
Small Organic Molecule
Emp. Form.:
C27H25N3O5
Mol. Mass.:
471.5045
SMILES:
CC(CC(O)=O)NC(=O)c1ncc2n(Cc3ccccc3)c(=O)c(Cc3ccccc3)cc2c1O
: