Target
Egl nine homolog 1
Ligand
BDBM141720
Substrate
Meas. Tech.
HIF-PH Assay
pH
7.4±n/a
IC50
198900±n/a nM
Comments
extracted
Citation
 Ng, DArend, MPFlippin, LA Naphthyridine derivatives as inhibitors of Hypoxia inducible factor (HIF) hydroxylase US Patent  US9695170 Publication Date 7/4/2017 
Target
Name:
Egl nine homolog 1
Synonyms:
C1orf12 EGLN1_HUMAN Hypoxia-inducible factor prolyl hydroxylase 2 (HIF-PH2) Prolyl hydroxylase domain-containing protein 2 (PHD2)
Type:
Protein
Mol. Mass.:
46035.59
Organism:
Homo sapiens (Human)
Description:
Q9GZT9
Residue:
426
  
Inhibitor
Name:
BDBM141720
Synonyms:
US8921389, 178 | US9695170 178
Type:
Small organic molecule
Emp. Form.:
C31H26N4O5
Mol. Mass.:
534.5619
SMILES:
Cc1ncccc1-c1nc(C(=O)NCCC(O)=O)c(O)c2cc(-c3ccccc3)c(=O)n(Cc3ccccc3)c12
: