Target
Hexokinase-1
Ligand
BDBM34343
Substrate
Meas. Tech.
Dose Response confirmation of activators of hexokinase domain containing I (HKDC1) in the hexokinase 1 selectivity assay
EC50
>80000±n/a nM
Citation
 PubChem, PC Dose Response confirmation of activators of hexokinase domain containing I (HKDC1) in the hexokinase 1 selectivity assay PubChem Bioassay (2011)[AID] 
Target
Name:
Hexokinase-1
Synonyms:
Brain form hexokinase HK1 Hexokinase type I hexokinase-1 isoform HKI
Type:
PROTEIN
Mol. Mass.:
102488.34
Organism:
Homo sapiens (Human)
Description:
EBI_11382
Residue:
917
  
Inhibitor
Name:
BDBM34343
Synonyms:
4-(6-ethylindolo[2,3-b]quinoxalin-2-yl)sulfonylmorpholine MLS000058610 cid_2545261
Type:
Small organic molecule
Emp. Form.:
C20H20N4O3S
Mol. Mass.:
396.463
SMILES:
CCn1c2ccccc2c2nc3cc(ccc3nc12)S(=O)(=O)N1CCOCC1
: