Target
Hexokinase-1
Ligand
BDBM80770
Substrate
Meas. Tech.
Dose Response confirmation of activators of hexokinase domain containing I (HKDC1) in the hexokinase 1 selectivity assay
EC50
49300±n/a nM
Citation
 PubChem, PC Dose Response confirmation of activators of hexokinase domain containing I (HKDC1) in the hexokinase 1 selectivity assay PubChem Bioassay (2011)[AID] 
Target
Name:
Hexokinase-1
Synonyms:
Brain form hexokinase HK1 Hexokinase type I hexokinase-1 isoform HKI
Type:
PROTEIN
Mol. Mass.:
102488.34
Organism:
Homo sapiens (Human)
Description:
EBI_11382
Residue:
917
  
Inhibitor
Name:
BDBM80770
Synonyms:
4-(3-bromophenyl)-1,3-thiazol-2-amine MLS000539317 [4-(3-bromophenyl)thiazol-2-yl]amine | cid_723330
Type:
Small organic molecule
Emp. Form.:
C9H7BrN2S
Mol. Mass.:
255.134
SMILES:
Nc1nc(cs1)-c1cccc(Br)c1
: