Target
Hexokinase-1
Ligand
BDBM74476
Substrate
Meas. Tech.
Dose Response confirmation of activators of hexokinase domain containing I (HKDC1) in the hexokinase 1 selectivity assay
EC50
>80000±n/a nM
Citation
 PubChem, PC Dose Response confirmation of activators of hexokinase domain containing I (HKDC1) in the hexokinase 1 selectivity assay PubChem Bioassay (2011)[AID] 
Target
Name:
Hexokinase-1
Synonyms:
Brain form hexokinase HK1 Hexokinase type I hexokinase-1 isoform HKI
Type:
PROTEIN
Mol. Mass.:
102488.34
Organism:
Homo sapiens (Human)
Description:
EBI_11382
Residue:
917
  
Inhibitor
Name:
BDBM74476
Synonyms:
4-({[1-(4-chlorophenyl)-3-methyl-5-oxo-1,5-dihydro-4H-pyrazol-4-ylidene]methyl}amino)-3-methoxybenzenesulfenyl cyanide SMR000162007 [4-[[(Z)-[1-(4-chlorophenyl)-3-methyl-5-oxopyrazol-4-ylidene]methyl]amino]-3-methoxyphenyl] thiocyanate thiocyanic acid [4-[[(Z)-[1-(4-chlorophenyl)-3-methyl-5-oxo-4-pyrazolylidene]methyl]amino]-3-methoxyphenyl] ester | thiocyanic acid [4-[[(Z)-[1-(4-chlorophenyl)-5-keto-3-methyl-2-pyrazolin-4-ylidene]methyl]amino]-3-methoxy-phenyl] ester
Type:
Small organic molecule
Emp. Form.:
C19H15ClN4O2S
Mol. Mass.:
398.866
SMILES:
COc1cc(SC#N)ccc1N=Cc1c(C)[nH]n(-c2ccc(Cl)cc2)c1=O
: