Target
Hexokinase-1
Ligand
BDBM80777
Substrate
Meas. Tech.
Dose Response confirmation of activators of hexokinase domain containing I (HKDC1) in the hexokinase 1 selectivity assay
EC50
42300±n/a nM
Citation
 PubChem, PC Dose Response confirmation of activators of hexokinase domain containing I (HKDC1) in the hexokinase 1 selectivity assay PubChem Bioassay (2011)[AID] 
Target
Name:
Hexokinase-1
Synonyms:
Brain form hexokinase HK1 Hexokinase type I hexokinase-1 isoform HKI
Type:
PROTEIN
Mol. Mass.:
102488.34
Organism:
Homo sapiens (Human)
Description:
EBI_11382
Residue:
917
  
Inhibitor
Name:
BDBM80777
Synonyms:
(6E)-6-[[(4-amino-1,2,4-triazol-3-yl)hydrazo]methylidene]-2,4-dibromo-1-cyclohexa-2,4-dienone;hydrochloride (6E)-6-[[2-(4-azanyl-1,2,4-triazol-3-yl)hydrazinyl]methylidene]-2,4-bis(bromanyl)cyclohexa-2,4-dien-1-one;hydrochloride 3,5-dibromo-2-hydroxybenzaldehyde (4-amino-4H-1,2,4-triazol-3-yl)hydrazone SMR000161885 | cid_11958783
Type:
Small organic molecule
Emp. Form.:
C9H8Br2N6O
Mol. Mass.:
376.007
SMILES:
Nn1cnnc1N=NCc1cc(Br)cc(Br)c1O
: