Target
Hexokinase-1
Ligand
BDBM80780
Substrate
Meas. Tech.
Dose Response confirmation of activators of hexokinase domain containing I (HKDC1) in the hexokinase 1 selectivity assay
EC50
57500±n/a nM
Citation
 PubChem, PC Dose Response confirmation of activators of hexokinase domain containing I (HKDC1) in the hexokinase 1 selectivity assay PubChem Bioassay (2011)[AID] 
Target
Name:
Hexokinase-1
Synonyms:
Brain form hexokinase HK1 Hexokinase type I hexokinase-1 isoform HKI
Type:
PROTEIN
Mol. Mass.:
102488.34
Organism:
Homo sapiens (Human)
Description:
EBI_11382
Residue:
917
  
Inhibitor
Name:
BDBM80780
Synonyms:
4-Benzyl-7-fluoro-2-methyl-4H-thiazolo[5,4-b]indole 4-benzyl-7-fluoro-2-methyl-thiazol[5,4-b]indole 7-fluoro-2-methyl-4-(phenylmethyl)thiazolo[5,4-b]indole SMR000221581 | cid_2039005
Type:
Small organic molecule
Emp. Form.:
C17H13FN2S
Mol. Mass.:
296.362
SMILES:
Cc1nc2c(s1)n(Cc1ccccc1)c1ccc(F)cc21
: