Target
Hexokinase-1
Ligand
BDBM80783
Substrate
Meas. Tech.
Dose Response confirmation of activators of hexokinase domain containing I (HKDC1) in the hexokinase 1 selectivity assay
EC50
>80000±n/a nM
Citation
 PubChem, PC Dose Response confirmation of activators of hexokinase domain containing I (HKDC1) in the hexokinase 1 selectivity assay PubChem Bioassay (2011)[AID] 
Target
Name:
Hexokinase-1
Synonyms:
Brain form hexokinase HK1 Hexokinase type I hexokinase-1 isoform HKI
Type:
PROTEIN
Mol. Mass.:
102488.34
Organism:
Homo sapiens (Human)
Description:
EBI_11382
Residue:
917
  
Inhibitor
Name:
BDBM80783
Synonyms:
3,5-Dimethoxy-N-[N'-(pyrazine-2-carbonyl)-hydrazinocarbothioyl]-benzamide 3,5-dimethoxy-N-[(pyrazine-2-carbonylamino)carbamothioyl]benzamide 3,5-dimethoxy-N-[[[oxo(2-pyrazinyl)methyl]hydrazo]-sulfanylidenemethyl]benzamide SMR000219116 | cid_1881906
Type:
Small organic molecule
Emp. Form.:
C15H15N5O4S
Mol. Mass.:
361.376
SMILES:
COc1cc(OC)cc(c1)C(=O)NC(=S)NNC(=O)c1cnccn1
: