Target
Hexokinase-1
Ligand
BDBM80712
Substrate
Meas. Tech.
Dose Response confirmation of activators of hexokinase domain containing I (HKDC1) in the hexokinase 1 selectivity assay
EC50
>80000±n/a nM
Citation
 PubChem, PC Dose Response confirmation of activators of hexokinase domain containing I (HKDC1) in the hexokinase 1 selectivity assay PubChem Bioassay (2011)[AID] 
Target
Name:
Hexokinase-1
Synonyms:
Brain form hexokinase HK1 Hexokinase type I hexokinase-1 isoform HKI
Type:
PROTEIN
Mol. Mass.:
102488.34
Organism:
Homo sapiens (Human)
Description:
EBI_11382
Residue:
917
  
Inhibitor
Name:
BDBM80712
Synonyms:
2,3-Dihydro-benzo[1,4]dioxine-6-carboxylic acid [1-(2,4-dihydroxy-phenyl)-meth-(E)-ylidene-hydrazinocarbonylmethyl]-amide N-[2-[2-[(E)-(2-hydroxy-4-oxocyclohexa-2,5-dien-1-ylidene)methyl]hydrazinyl]-2-oxoethyl]-2,3-dihydro-1,4-benzodioxine-6-carboxamide N-[2-[[(E)-(2-hydroxy-4-oxo-1-cyclohexa-2,5-dienylidene)methyl]hydrazo]-2-oxoethyl]-2,3-dihydro-1,4-benzodioxin-6-carboxamide SMR000220720 | cid_15944930
Type:
Small organic molecule
Emp. Form.:
C18H17N3O6
Mol. Mass.:
371.3441
SMILES:
Oc1ccc(C=NNC(=O)CNC(=O)c2ccc3OCCOc3c2)c(O)c1
: