Target
Hexokinase-1
Ligand
BDBM80787
Substrate
Meas. Tech.
Dose Response confirmation of activators of hexokinase domain containing I (HKDC1) in the hexokinase 1 selectivity assay
EC50
53200±n/a nM
Citation
 PubChem, PC Dose Response confirmation of activators of hexokinase domain containing I (HKDC1) in the hexokinase 1 selectivity assay PubChem Bioassay (2011)[AID] 
Target
Name:
Hexokinase-1
Synonyms:
Brain form hexokinase HK1 Hexokinase type I hexokinase-1 isoform HKI
Type:
PROTEIN
Mol. Mass.:
102488.34
Organism:
Homo sapiens (Human)
Description:
EBI_11382
Residue:
917
  
Inhibitor
Name:
BDBM80787
Synonyms:
5-(2-fluorophenyl)-N-(2-methylphenyl)-6H-1,3,4-thiadiazin-2-amine SMR000260132 cid_5147972
Type:
Small organic molecule
Emp. Form.:
C16H14FN3S
Mol. Mass.:
299.366
SMILES:
Cc1ccccc1NC1=NN=C(CS1)c1ccccc1F
: