Target
Hexokinase HKDC1 [W721R]
Ligand
BDBM64773
Substrate
Meas. Tech.
Dose Response confirmation of inhibitors of hexokinase domain containing I (HKDC1) in the hexokinase 1 selectivity assay
IC50
80000±n/a nM
Citation
 PubChem, PC Dose Response confirmation of inhibitors of hexokinase domain containing I (HKDC1) in the hexokinase 1 selectivity assay PubChem Bioassay (2011)[AID] 
Target
Name:
Hexokinase HKDC1 [W721R]
Synonyms:
HKDC1 putative hexokinase HKDC1
Type:
Enzyme Catalytic Domain
Mol. Mass.:
102520.24
Organism:
Homo sapiens (Human)
Description:
gi_156151420
Residue:
917
  
Inhibitor
Name:
BDBM64773
Synonyms:
(1E)-2-[6-[[amino-[(E)-[amino-(4-chloroanilino)methylene]amino]methylene]amino]hexyl]-1-[amino-(4-chloroanilino)methylene]guanidine (1E)-2-[6-[[azanyl-[(E)-[azanyl-[(4-chlorophenyl)amino]methylidene]amino]methylidene]amino]hexyl]-1-[azanyl-[(4-chlorophenyl)amino]methylidene]guanidine Chlorhexidine SMR000857146 | cid_9552079
Type:
Small organic molecule
Emp. Form.:
C22H30Cl2N10
Mol. Mass.:
505.447
SMILES:
NC(Nc1ccc(Cl)cc1)=NC(N)=NCCCCCCN=C(N)N=C(N)Nc1ccc(Cl)cc1
: