Target
Glucose-6-phosphate dehydrogenase-6-phosphogluconolactonase
Ligand
BDBM81112
Substrate
Meas. Tech.
Dose Response confirmation of uHTS small molecule inhibitors of Plasmodium falciparum Glucose-6-phosphate dehydrogenase via a fluorescence intensity assay
IC50
6030±n/a nM
Citation
 PubChem, PC Dose Response confirmation of uHTS small molecule inhibitors of Plasmodium falciparum Glucose-6-phosphate dehydrogenase via a fluorescence intensity assay PubChem Bioassay (2011)[AID] 
Target
Name:
Glucose-6-phosphate dehydrogenase-6-phosphogluconolactonase
Synonyms:
Type:
Enzyme Catalytic Domain
Mol. Mass.:
109731.64
Organism:
Plasmodium falciparum 3D7
Description:
gi_12381848
Residue:
950
  
Inhibitor
Name:
BDBM81112
Synonyms:
2,5-bis(1-pyrazolyl)benzene-1,4-diol 2,5-di(pyrazol-1-yl)hydroquinone SMR000529087 | cid_371593
Type:
Small organic molecule
Emp. Form.:
C12H10N4O2
Mol. Mass.:
242.2334
SMILES:
Oc1cc(c(O)cc1-n1cccn1)-n1cccn1
: