Target
Glucose-6-phosphate 1-dehydrogenase
Ligand
BDBM52759
Substrate
Meas. Tech.
Human Glucose-6-Phosphate Dehydrogenase Dose Response Selectivity Assay for Inhibitors of Plasmodium falciparum Glucose-6-Phosphate Dehydrogenase
IC50
>80000±n/a nM
Citation
 PubChem, PC Human Glucose-6-Phosphate Dehydrogenase Dose Response Selectivity Assay for Inhibitors of Plasmodium falciparum Glucose-6-Phosphate Dehydrogenase PubChem Bioassay (2011)[AID] 
Target
Name:
Glucose-6-phosphate 1-dehydrogenase
Synonyms:
G6PD Glucose 6-phosphate dehydrogenase (G6PD) glucose-6-phosphate 1-dehydrogenase isoform b
Type:
Enzyme
Mol. Mass.:
59258.58
Organism:
Homo sapiens (Human)
Description:
P11413
Residue:
515
  
Inhibitor
Name:
BDBM52759
Synonyms:
5,8-dihydroxy-2-(4-hydroxy-3-methoxy-phenyl)-6,7-dimethoxy-chromone 5,8-dihydroxy-2-(4-hydroxy-3-methoxyphenyl)-6,7-dimethoxychromen-4-one MLS000876977 cid_11726019
Type:
Small organic molecule
Emp. Form.:
C18H16O8
Mol. Mass.:
360.3148
SMILES:
COc1cc(ccc1O)-c1cc(=O)c2c(O)c(OC)c(OC)c(O)c2o1
: