Target
cAMP-dependent protein kinase type I-alpha regulatory subunit
Ligand
BDBM81291
Substrate
Meas. Tech.
Fluorescence polarization-based biochemical high throughput dose response assay for activators of the Protein Kinase A-R1A (PKA-R1A) complex
EC50
32.68±n/a nM
Citation
 PubChem, PC Fluorescence polarization-based biochemical high throughput dose response assay for activators of the Protein Kinase A-R1A (PKA-R1A) complex PubChem Bioassay (2011)[AID] 
Target
Name:
cAMP-dependent protein kinase type I-alpha regulatory subunit
Synonyms:
KAP0_BOVIN cAMP-dependent protein kinase
Type:
Enzyme Catalytic Domain
Mol. Mass.:
42885.14
Organism:
Bos taurus
Description:
gi_115496662
Residue:
380
  
Inhibitor
Name:
BDBM81291
Synonyms:
8-(4-Chlorophenylthio)adenosine 3',5'-cyclic monophosphate sodium salt SMR000326853 sodium;(4aR,6R,7R,7aS)-6-[6-amino-8-(4-chlorophenyl)sulfanylpurin-9-yl]-2-oxido-2-oxo-4a,6,7,7a-tetrahydro-4H-furo[3,2-d][1,3,2]dioxaphosphinin-7-ol sodium;(4aR,6R,7R,7aS)-6-[6-amino-8-[(4-chlorophenyl)thio]purin-9-yl]-2-keto-2-oxido-4a,6,7,7a-tetrahydro-4H-furo[3,2-d][1,3,2]dioxaphosphorin-7-ol | sodium;(4aR,6R,7R,7aS)-6-[6-azanyl-8-(4-chlorophenyl)sulfanyl-purin-9-yl]-2-oxidanidyl-2-oxidanylidene-4a,6,7,7a-tetrahydro-4H-furo[3,2-d][1,3,2]dioxaphosphinin-7-ol
Type:
Small organic molecule
Emp. Form.:
C16H14ClN5O6PS
Mol. Mass.:
470.805
SMILES:
Nc1ncnc2n([C@@H]3O[C@@H]4COP([O-])(=O)O[C@H]4[C@H]3O)c(Sc3ccc(Cl)cc3)nc12
: