Target
Chitotriosidase-1
Ligand
BDBM10853
Substrate
Meas. Tech.
Inhibition Assay
pH
5.5±0
IC50
4.5e+3±0 nM
Citation
 Andersen, OANathubhai, ADixon, MJEggleston, IMvan Aalten, DM Structure-based dissection of the natural product cyclopentapeptide chitinase inhibitor argifin. Chem Biol 15:295-301 (2008)  
Target
Name:
Chitotriosidase-1
Synonyms:
CHIT1 Chitinase 1 Chitotriosidase Chitotriosidase-1 (CHIT1)
Type:
Enzyme
Mol. Mass.:
51682.25
Organism:
Homo sapiens (Human)
Description:
Q13231
Residue:
466
  
Inhibitor
Name:
BDBM10853
Synonyms:
(2R,5S,8S,11S,15S)-8-benzyl-2,7-dimethyl-5-[3-({[(methylcarbamoyl)amino]methanimidoyl}amino)propyl]-3,6,9,13,17-pentaoxo-1,4,7,10,14-pentaazacycloheptadecane-11,15-dicarboxylic acid | Argifin
Type:
Small organic molecule
Emp. Form.:
C29H41N9O10
Mol. Mass.:
675.6901
SMILES:
CNC(=O)NC(=N)NCCC[C@@H]1NC(=O)[C@@H](C)NC(=O)C[C@H](NC(=O)C[C@H](NC(=O)[C@H](Cc2ccccc2)N(C)C1=O)C(O)=O)C(O)=O
: