Target
Cyclin-dependent kinase 1
Ligand
BDBM81433
Substrate
Meas. Tech.
In Vitro Kinase Assay
Ki
86±63 nM
Citation
 Wang, SGriffiths, GMidgley, CABarnett, ALCooper, MGrabarek, JIngram, LJackson, WKontopidis, GMcClue, SJMcInnes, CMcLachlan, JMeades, CMezna, MStuart, IThomas, MPZheleva, DILane, DPJackson, RCGlover, DMBlake, DGFischer, PM Discovery and characterization of 2-anilino-4- (thiazol-5-yl)pyrimidine transcriptional CDK inhibitors as anticancer agents. Chem Biol 17:1111-21 (2010)  
Target
Name:
Cyclin-dependent kinase 1
Synonyms:
CDC2 CDK1 CDKN1 Cell division protein kinase 1 P34CDC2 | p34 protein kinase
Type:
Enzyme Subunit
Mol. Mass.:
34101.08
Organism:
Homo sapiens (Human)
Description:
P06493
Residue:
297
  
Inhibitor
Name:
BDBM81433
Synonyms:
CDK Inhibitor, 6
Type:
Small organic molecule
Emp. Form.:
C16H17N5O2S2
Mol. Mass.:
375.468
SMILES:
CNc1nc(C)c(s1)-c1ccnc(Nc2cccc(c2)S(C)(=O)=O)n1
: