Target
Cyclin-dependent kinase 4
Ligand
BDBM81430
Substrate
Meas. Tech.
In Vitro Kinase Assay
Ki
9.1±2.9 nM
Citation
 Wang, SGriffiths, GMidgley, CABarnett, ALCooper, MGrabarek, JIngram, LJackson, WKontopidis, GMcClue, SJMcInnes, CMcLachlan, JMeades, CMezna, MStuart, IThomas, MPZheleva, DILane, DPJackson, RCGlover, DMBlake, DGFischer, PM Discovery and characterization of 2-anilino-4- (thiazol-5-yl)pyrimidine transcriptional CDK inhibitors as anticancer agents. Chem Biol 17:1111-21 (2010)  
Target
Name:
Cyclin-dependent kinase 4
Synonyms:
CDK4 Cell division protein kinase 4 PSK-J3
Type:
Enzyme Subunit
Mol. Mass.:
33731.96
Organism:
Homo sapiens (Human)
Description:
P11802
Residue:
303
  
Inhibitor
Name:
BDBM81430
Synonyms:
CDK Inhibitor, 3
Type:
Small organic molecule
Emp. Form.:
C15H16N6O2S2
Mol. Mass.:
376.457
SMILES:
CNc1nc(C)c(s1)-c1ccnc(Nc2cccc(c2)S(N)(=O)=O)n1
: