Target
Cyclin-dependent kinase 4
Ligand
BDBM81438
Substrate
Meas. Tech.
In Vitro Kinase Assay
Ki
>500±0 nM
Citation
 Wang, SGriffiths, GMidgley, CABarnett, ALCooper, MGrabarek, JIngram, LJackson, WKontopidis, GMcClue, SJMcInnes, CMcLachlan, JMeades, CMezna, MStuart, IThomas, MPZheleva, DILane, DPJackson, RCGlover, DMBlake, DGFischer, PM Discovery and characterization of 2-anilino-4- (thiazol-5-yl)pyrimidine transcriptional CDK inhibitors as anticancer agents. Chem Biol 17:1111-21 (2010)  
Target
Name:
Cyclin-dependent kinase 4
Synonyms:
CDK4 Cell division protein kinase 4 PSK-J3
Type:
Enzyme Subunit
Mol. Mass.:
33731.96
Organism:
Homo sapiens (Human)
Description:
P11802
Residue:
303
  
Inhibitor
Name:
BDBM81438
Synonyms:
CDK Inhibitor, 11
Type:
Small organic molecule
Emp. Form.:
C18H21N5O4S2
Mol. Mass.:
435.52
SMILES:
COCCNS(=O)(=O)c1ccc(Nc2nccc(n2)-c2sc(=O)n(C)c2C)cc1
: