Target
Cyclin-dependent kinase 7
Ligand
BDBM81434
Substrate
Meas. Tech.
In Vitro Kinase Assay
Ki
47±24 nM
Citation
 Wang, SGriffiths, GMidgley, CABarnett, ALCooper, MGrabarek, JIngram, LJackson, WKontopidis, GMcClue, SJMcInnes, CMcLachlan, JMeades, CMezna, MStuart, IThomas, MPZheleva, DILane, DPJackson, RCGlover, DMBlake, DGFischer, PM Discovery and characterization of 2-anilino-4- (thiazol-5-yl)pyrimidine transcriptional CDK inhibitors as anticancer agents. Chem Biol 17:1111-21 (2010)  
Target
Name:
Cyclin-dependent kinase 7
Synonyms:
39 kDa protein kinase CAK1 CDK-activating kinase 1 (CAK) CDK7_HUMAN Cell division protein kinase 7 Cyclin-dependent kinase 7 (CDK7/cyclin H) P39 Mo15 TFIIH basal transcription factor complex kinase subunit
Type:
Enzyme Subunit
Mol. Mass.:
39047.01
Organism:
Homo sapiens (Human)
Description:
Residue:
346
  
Inhibitor
Name:
BDBM81434
Synonyms:
CDK Inhibitor, 7
Type:
Small organic molecule
Emp. Form.:
C17H19N5O2S2
Mol. Mass.:
389.495
SMILES:
CCNc1nc(C)c(s1)-c1ccnc(Nc2cccc(c2)S(C)(=O)=O)n1
: