Target
Cyclin-dependent kinase 9
Ligand
BDBM8061
Substrate
Meas. Tech.
In Vitro Kinase Assay
Ki
4.6±5.2 nM
Citation
 Wang, SGriffiths, GMidgley, CABarnett, ALCooper, MGrabarek, JIngram, LJackson, WKontopidis, GMcClue, SJMcInnes, CMcLachlan, JMeades, CMezna, MStuart, IThomas, MPZheleva, DILane, DPJackson, RCGlover, DMBlake, DGFischer, PM Discovery and characterization of 2-anilino-4- (thiazol-5-yl)pyrimidine transcriptional CDK inhibitors as anticancer agents. Chem Biol 17:1111-21 (2010)  
Target
Name:
Cyclin-dependent kinase 9
Synonyms:
C-2K CDK9 Cell division cycle 2-like protein kinase 4 Cyclin-Dependent Kinase 9 (CDK9) Serine/threonine-protein kinase PITALRE Tat-associated kinase complex catalytic subunit
Type:
Enzyme Subunit
Mol. Mass.:
42789.13
Organism:
Homo sapiens (Human)
Description:
Residue:
372
  
Inhibitor
Name:
BDBM8061
Synonyms:
2-Anilino-4-(thiazol-5-yl)pyrimidine deriv. 32 4-methyl-5-{2-[(3-nitrophenyl)amino]pyrimidin-4-yl}-1,3-thiazol-2-amine [4-(2-Amino-4-methylthiazol-5-yl)pyrimidin-2-yl](3-nitrophenyl)amine
Type:
Small organic molecule
Emp. Form.:
C14H12N6O2S
Mol. Mass.:
328.349
SMILES:
Cc1nc(N)sc1-c1ccnc(Nc2cccc(c2)N(=O)=O)n1
: