Target
5-hydroxytryptamine receptor 7
Ligand
BDBM55121
Substrate
Ki
240±n/a nM
Comments
PDSP_728
Citation
 Greenberg, DAPrichard, DCSnyder, SH Alpha-noradrenergic receptor binding in mammalian brain: differential labeling of agonist and antagonist states. Life Sci 19:69-76 (1976)  
Target
Name:
5-hydroxytryptamine receptor 7
Synonyms:
5-HT-7 5-HT7 5-HT7S 5-hydroxytryptamine receptor 7 5HT7R_RAT GPRFO Serotonin (5-HT) receptor | Serotonin Receptor 7
Type:
G Protein-Coupled Receptor (GPCR)
Mol. Mass.:
49852.62
Organism:
Rattus norvegicus (rat)
Description:
Rat cloned 5-HT7R.
Residue:
448
  
Inhibitor
Name:
BDBM55121
Synonyms:
3-HYDROXYTYRAMINE HYDROCHLORIDE 4-(2-aminoethyl)pyrocatechol;hydrochloride Dopamine SMR000059081 | cid_65340
Type:
Small organic molecule
Emp. Form.:
C8H11NO2
Mol. Mass.:
153.1784
SMILES:
NCCc1ccc(O)c(O)c1
: