Target
5-hydroxytryptamine receptor 7
Ligand
BDBM84342
Substrate
Ki
5.4±n/a nM
Comments
PDSP_238
Citation
 Greenberg, DAPrichard, DCSnyder, SH Alpha-noradrenergic receptor binding in mammalian brain: differential labeling of agonist and antagonist states. Life Sci 19:69-76 (1976)  
Target
Name:
5-hydroxytryptamine receptor 7
Synonyms:
5-HT-7 5-HT7 5-HT7S 5-hydroxytryptamine receptor 7 5HT7R_RAT GPRFO Serotonin (5-HT) receptor | Serotonin Receptor 7
Type:
G Protein-Coupled Receptor (GPCR)
Mol. Mass.:
49852.62
Organism:
Rattus norvegicus (rat)
Description:
Rat cloned 5-HT7R.
Residue:
448
  
Inhibitor
Name:
BDBM84342
Synonyms:
4-[1-hydroxy-2-(methylamino)ethyl]benzene-1,2-diol 4-[1-hydroxy-2-(methylamino)ethyl]benzene-1,2-diol;hydrochloride 4-[2-(methylamino)-1-oxidanyl-ethyl]benzene-1,2-diol;hydrochloride EPINEPHRINE MLS001333244 cid_5924
Type:
Small organic molecule
Emp. Form.:
C9H13NO3
Mol. Mass.:
183.2044
SMILES:
CNCC(O)c1ccc(O)c(O)c1
: