Target
5-hydroxytryptamine receptor 7
Ligand
BDBM81443
Substrate
Ki
5000±n/a nM
Comments
PDSP_2765
Citation
 Greenberg, DAPrichard, DCSnyder, SH Alpha-noradrenergic receptor binding in mammalian brain: differential labeling of agonist and antagonist states. Life Sci 19:69-76 (1976)  
Target
Name:
5-hydroxytryptamine receptor 7
Synonyms:
5-HT-7 5-HT7 5-HT7S 5-hydroxytryptamine receptor 7 5HT7R_RAT GPRFO Serotonin (5-HT) receptor | Serotonin Receptor 7
Type:
G Protein-Coupled Receptor (GPCR)
Mol. Mass.:
49852.62
Organism:
Rattus norvegicus (rat)
Description:
Rat cloned 5-HT7R.
Residue:
448
  
Inhibitor
Name:
BDBM81443
Synonyms:
CAS_57-24-9 Strychnine
Type:
Small organic molecule
Emp. Form.:
C21H22N2O3
Mol. Mass.:
350.411
SMILES:
[O-][N+]12CCC34C1CC1C5C3N(c3ccccc43)C(=O)CC5OCC=C1C2
: