Target
Beta-2 adrenergic receptor
Ligand
BDBM81452
Substrate
Ki
>10000±n/a nM
Comments
PDSP_672
Citation
 Bylund, DBSnyder, SH Beta adrenergic receptor binding in membrane preparations from mammalian brain. Mol Pharmacol 12:568-80 (1976) Target
Name:
Beta-2 adrenergic receptor
Synonyms:
ADRB2 ADRB2_HUMAN Beta-2 adrenoceptor | Beta-2 adrenoreceptor
Type:
Mol. Mass.:
46461.69
Organism:
Homo sapiens (Human)
Description:
P07550
Residue:
413
  
Inhibitor
Name:
BDBM81452
Synonyms:
CAS_91533 NSC_91533
Type:
Small organic molecule
Emp. Form.:
C20H24N2
Mol. Mass.:
292.418
SMILES:
CC(C1=C(CCN(C)C)Cc2ccccc12)c1ccccn1
: