Target
Beta-2 adrenergic receptor
Ligand
BDBM50292375
Substrate
Ki
>10000±n/a nM
Comments
PDSP_1789
Citation
 Bylund, DBSnyder, SH Beta adrenergic receptor binding in membrane preparations from mammalian brain. Mol Pharmacol 12:568-80 (1976) Target
Name:
Beta-2 adrenergic receptor
Synonyms:
ADRB2 ADRB2_HUMAN Beta-2 adrenoceptor | Beta-2 adrenoreceptor
Type:
Mol. Mass.:
46461.69
Organism:
Homo sapiens (Human)
Description:
P07550
Residue:
413
  
Inhibitor
Name:
BDBM50292375
Synonyms:
(-)-4-hydroxy-alpha-[(methylamino)methyl]benzenemethanol (-)-Sympatol (-)-p-hydroxy-alpha-[(methylamino)methyl]benzyl alcohol CHEMBL443893 D-synephrine | Synephrine,(+/-)
Type:
Small organic molecule
Emp. Form.:
C9H13NO2
Mol. Mass.:
167.205
SMILES:
CNC[C@H](O)c1ccc(O)cc1
: