Target
Alpha-1A adrenergic receptor
Ligand
BDBM10758
Substrate
Ki
21000±n/a nM
Comments
PDSP_20607
Citation
 U'Prichard, DCGreenberg, DASnyder, SH Binding characteristics of a radiolabeled agonist and antagonist at central nervous system alpha noradrenergic receptors. Mol Pharmacol 13:454-73 (1977) Target
Name:
Alpha-1A adrenergic receptor
Synonyms:
ADA1A_RAT Adra1c Alpha-1A adrenoceptor Alpha-1C adrenergic receptor | adrenergic Alpha1A
Type:
Protein
Mol. Mass.:
51620.15
Organism:
Rattus norvegicus (Rat)
Description:
P43140
Residue:
466
  
Inhibitor
Name:
BDBM10758
Synonyms:
14C-phenylethylamine CHEMBL610 | phenylethylamine
Type:
Small organic molecule
Emp. Form.:
C8H11N
Mol. Mass.:
121.1796
SMILES:
NCCc1ccccc1
: