Target
Alpha-1A adrenergic receptor
Ligand
BDBM50027056
Substrate
Ki
4.2±n/a nM
Comments
PDSP_20561
Citation
 U'Prichard, DCGreenberg, DASnyder, SH Binding characteristics of a radiolabeled agonist and antagonist at central nervous system alpha noradrenergic receptors. Mol Pharmacol 13:454-73 (1977) Target
Name:
Alpha-1A adrenergic receptor
Synonyms:
ADA1A_RAT Adra1c Alpha-1A adrenoceptor Alpha-1C adrenergic receptor | adrenergic Alpha1A
Type:
Protein
Mol. Mass.:
51620.15
Organism:
Rattus norvegicus (Rat)
Description:
P43140
Residue:
466
  
Inhibitor
Name:
BDBM50027056
Synonyms:
(4,5-Dihydro-1H-imidazol-2-yl)-(5,6,7,8-tetrahydro-naphthalen-1-yl)-amine Imidazolidin-2-ylidene-(5,6,7,8-tetrahydro-naphthalen-1-yl)-amine | Tramazoline
Type:
Small organic molecule
Emp. Form.:
C13H17N3
Mol. Mass.:
215.2942
SMILES:
[#6]-1-[#6]-[#7]\[#6](-[#7]-1)=[#7]\c1cccc2-[#6]-[#6]-[#6]-[#6]-c12
: