Target
Histamine H1 receptor
Ligand
BDBM50062261
Substrate
Ki
1.3±n/a nM
Comments
PDSP_1912
Citation
 Tran, VTChang, RSSnyder, SH Histamine H1 receptors identified in mammalian brain membranes with [3H]mepyramine. Proc Natl Acad Sci U S A 75:6290-4 (1978)  
Target
Name:
Histamine H1 receptor
Synonyms:
HISTAMINE H1 Hrh1
Type:
Enzyme Catalytic Domain
Mol. Mass.:
55716.35
Organism:
RAT
Description:
HISTAMINE H1 HRH1 RAT::P31390
Residue:
486
  
Inhibitor
Name:
BDBM50062261
Synonyms:
CHEMBL829 Methylpromazine TRIMEPRAZINE | Temaril
Type:
Small organic molecule
Emp. Form.:
C18H22N2S
Mol. Mass.:
298.446
SMILES:
CC(CN(C)C)CN1c2ccccc2Sc2ccccc12
: